Target
Orexin/Hypocretin receptor type 1
Ligand
BDBM334702
Substrate
Meas. Tech.
Inhibition Assay
IC50
0.900±n/a nM
Citation
 Boss, CBrotschi, CGude, MHeidmann, BSifferlen, TWilliams, J Benzimidazole-proline derivatives US Patent  US9732075 Publication Date 8/15/2017 
Target
Name:
Orexin/Hypocretin receptor type 1
Synonyms:
HCRTR1 OX1R_HUMAN Orexin receptor type 1 (OR 1) Orexin receptor type 1 (OX1) Orexin receptor type 1 (OxR1) | Ox1r
Type:
Protein
Mol. Mass.:
47554.50
Organism:
Homo sapiens (Human)
Description:
O43613
Residue:
425
  
Inhibitor
Name:
BDBM334702
Synonyms:
US11040966, Example 4.61 [(2S,3S)-2-(5-Chloro-4-methyl-1H-benzoimidazol-2-yl)-3-methyl-pyrrolidin-1-yl]-(4'-methyl-biphenyl-2-yl)-methanone
Type:
Small organic molecule
Emp. Form.:
C27H26ClN3O
Mol. Mass.:
443.968
SMILES:
C[C@H]1CCN([C@@H]1c1nc2c(C)c(Cl)ccc2[nH]1)C(=O)c1ccccc1-c1ccc(C)cc1
: