Target
Orexin/Hypocretin receptor type 1
Ligand
BDBM334749
Substrate
Meas. Tech.
Inhibition Assay
IC50
47.0±n/a nM
Citation
 Boss, CBrotschi, CGude, MHeidmann, BSifferlen, TWilliams, J Benzimidazole-proline derivatives US Patent  US9732075 Publication Date 8/15/2017 
Target
Name:
Orexin/Hypocretin receptor type 1
Synonyms:
HCRTR1 OX1R_HUMAN Orexin receptor type 1 (OR 1) Orexin receptor type 1 (OX1) Orexin receptor type 1 (OxR1) | Ox1r
Type:
Protein
Mol. Mass.:
47554.50
Organism:
Homo sapiens (Human)
Description:
O43613
Residue:
425
  
Inhibitor
Name:
BDBM334749
Synonyms:
US11040966, Example 4.107 [(2S,3S)-2-(5-Chloro-6-methyl-1H-benzoimidazol-2-yl)-3-methyl-pyrrolidin-1-yl]-(2-fluoro-6-pyridin-3-yl-phenyl)-methanone
Type:
Small organic molecule
Emp. Form.:
C25H22ClFN4O
Mol. Mass.:
448.92
SMILES:
C[C@H]1CCN([C@@H]1c1nc2cc(Cl)c(C)cc2[nH]1)C(=O)c1c(F)cccc1-c1cccnc1
: