Target
Orexin receptor type 2
Ligand
BDBM335091
Substrate
Meas. Tech.
Inhibition Assay
IC50
1.000±n/a nM
Citation
 Boss, CBrotschi, CGude, MHeidmann, BSifferlen, TWilliams, J Benzimidazole-proline derivatives US Patent  US9732075 Publication Date 8/15/2017 
Target
Name:
Orexin receptor type 2
Synonyms:
HCRTR2 OX2R_HUMAN Orexin receptor type 2 (OR-2) Orexin receptor type 2 (OX2R) Ox-2-R | Ox2-R
Type:
Protein
Mol. Mass.:
50710.53
Organism:
Homo sapiens (Human)
Description:
O43614
Residue:
444
  
Inhibitor
Name:
BDBM335091
Synonyms:
US11040966, Example 5.266 [(S)-2-(6-Bromo-4,5-dimethyl-1H-benzoimidazol-2-yl)-2-methyl-pyrrolidin-1-yl]-(5-methyl-2-[1,2,3]triazol-2-yl-phenyl)-methanone
Type:
Small organic molecule
Emp. Form.:
C24H25BrN6O
Mol. Mass.:
493.399
SMILES:
Cc1ccc(c(c1)C(=O)N1CCC[C@@]1(C)c1nc2c(C)c(C)c(Br)cc2[nH]1)-n1nccn1
: