Target
Orexin/Hypocretin receptor type 1
Ligand
BDBM335105
Substrate
Meas. Tech.
Inhibition Assay
IC50
36.0±n/a nM
Citation
 Boss, CBrotschi, CGude, MHeidmann, BSifferlen, TWilliams, J Benzimidazole-proline derivatives US Patent  US9732075 Publication Date 8/15/2017 
Target
Name:
Orexin/Hypocretin receptor type 1
Synonyms:
HCRTR1 OX1R_HUMAN Orexin receptor type 1 (OR 1) Orexin receptor type 1 (OX1) Orexin receptor type 1 (OxR1) | Ox1r
Type:
Protein
Mol. Mass.:
47554.50
Organism:
Homo sapiens (Human)
Description:
O43613
Residue:
425
  
Inhibitor
Name:
BDBM335105
Synonyms:
US11040966, Example 5.280 [(S)-2-(5,6-Dimethoxy-1H-benzoimidazol-2-yl)-2-methyl-pyrrolidin-1-yl]-(5-methyl-2-pyrimidin-2-yl-phenyl)-methanone
Type:
Small organic molecule
Emp. Form.:
C26H27N5O3
Mol. Mass.:
457.5243
SMILES:
COc1cc2nc([nH]c2cc1OC)[C@]1(C)CCCN1C(=O)c1cc(C)ccc1-c1ncccn1
: