Target
Orexin/Hypocretin receptor type 1
Ligand
BDBM335131
Substrate
Meas. Tech.
Inhibition Assay
IC50
33.0±n/a nM
Citation
 Boss, CBrotschi, CGude, MHeidmann, BSifferlen, TWilliams, J Benzimidazole-proline derivatives US Patent  US9732075 Publication Date 8/15/2017 
Target
Name:
Orexin/Hypocretin receptor type 1
Synonyms:
HCRTR1 OX1R_HUMAN Orexin receptor type 1 (OR 1) Orexin receptor type 1 (OX1) Orexin receptor type 1 (OxR1) | Ox1r
Type:
Protein
Mol. Mass.:
47554.50
Organism:
Homo sapiens (Human)
Description:
O43613
Residue:
425
  
Inhibitor
Name:
BDBM335131
Synonyms:
US11040966, Example 5.306 [(S)-2-(5-Chloro-4-methyl-1H-benzoimidazol-2-yl)-2-methyl-pyrrolidin-1-yl]-(3-fluoro-4-methoxy-4'-trifluoromethoxy-biphenyl-2-yl)-methanone
Type:
Small organic molecule
Emp. Form.:
C28H24ClF4N3O3
Mol. Mass.:
561.955
SMILES:
COc1ccc(-c2ccc(OC(F)(F)F)cc2)c(C(=O)N2CCC[C@@]2(C)c2nc3c(C)c(Cl)ccc3[nH]2)c1F
: