Target
Orexin receptor type 2
Ligand
BDBM335151
Substrate
Meas. Tech.
Inhibition Assay
IC50
0.700±n/a nM
Citation
 Boss, CBrotschi, CGude, MHeidmann, BSifferlen, TWilliams, J Benzimidazole-proline derivatives US Patent  US9732075 Publication Date 8/15/2017 
Target
Name:
Orexin receptor type 2
Synonyms:
HCRTR2 OX2R_HUMAN Orexin receptor type 2 (OR-2) Orexin receptor type 2 (OX2R) Ox-2-R | Ox2-R
Type:
Protein
Mol. Mass.:
50710.53
Organism:
Homo sapiens (Human)
Description:
O43614
Residue:
444
  
Inhibitor
Name:
BDBM335151
Synonyms:
US11040966, Example 6.112 [(S)-2-(7-Methyl-1H-benzoimidazol-2-yl)-4-methylene-pyrrolidin-1-yl]-[2-methyl-5-(3-trifluoromethyl-phenyl)-thiazol-4-yl]-methanone
Type:
Small organic molecule
Emp. Form.:
C25H21F3N4OS
Mol. Mass.:
482.521
SMILES:
Cc1nc(C(=O)N2CC(=C)C[C@H]2c2nc3cccc(C)c3[nH]2)c(s1)-c1cccc(c1)C(F)(F)F
: