Target
Orexin/Hypocretin receptor type 1
Ligand
BDBM335162
Substrate
Meas. Tech.
Inhibition Assay
IC50
0.900±n/a nM
Citation
 Boss, CBrotschi, CGude, MHeidmann, BSifferlen, TWilliams, J Benzimidazole-proline derivatives US Patent  US9732075 Publication Date 8/15/2017 
Target
Name:
Orexin/Hypocretin receptor type 1
Synonyms:
HCRTR1 OX1R_HUMAN Orexin receptor type 1 (OR 1) Orexin receptor type 1 (OX1) Orexin receptor type 1 (OxR1) | Ox1r
Type:
Protein
Mol. Mass.:
47554.50
Organism:
Homo sapiens (Human)
Description:
O43613
Residue:
425
  
Inhibitor
Name:
BDBM335162
Synonyms:
US11040966, Example 6.122 [(S)-2-(6-Chloro-7-methyl-1H-benzoimidazol-2-yl)-4-methylene-pyrrolidin-1-yl]-(2-methyl-5-m-tolyl-thiazol-4-yl)-methanone
Type:
Small organic molecule
Emp. Form.:
C25H23ClN4OS
Mol. Mass.:
462.994
SMILES:
Cc1nc(C(=O)N2CC(=C)C[C@H]2c2nc3ccc(Cl)c(C)c3[nH]2)c(s1)-c1cccc(C)c1
: