Target
Orexin/Hypocretin receptor type 1
Ligand
BDBM335287
Substrate
Meas. Tech.
Inhibition Assay
IC50
4.00±n/a nM
Citation
 Boss, CBrotschi, CGude, MHeidmann, BSifferlen, TWilliams, J Benzimidazole-proline derivatives US Patent  US9732075 Publication Date 8/15/2017 
Target
Name:
Orexin/Hypocretin receptor type 1
Synonyms:
HCRTR1 OX1R_HUMAN Orexin receptor type 1 (OR 1) Orexin receptor type 1 (OX1) Orexin receptor type 1 (OxR1) | Ox1r
Type:
Protein
Mol. Mass.:
47554.50
Organism:
Homo sapiens (Human)
Description:
O43613
Residue:
425
  
Inhibitor
Name:
BDBM335287
Synonyms:
US11040966, Example 6.58 [(S)-2-(4,6-Dimethyl-1H-benzoimidazol-2-yl)-4-methylene-pyrrolidin-1-yl]-[5-(3,4-dimethyl-phenyl)-2-methyl-thiazol-4-yl]-methanone
Type:
Small organic molecule
Emp. Form.:
C27H28N4OS
Mol. Mass.:
456.602
SMILES:
Cc1nc(C(=O)N2CC(=C)C[C@H]2c2nc3c(C)cc(C)cc3[nH]2)c(s1)-c1ccc(C)c(C)c1
: