Target
Orexin/Hypocretin receptor type 1
Ligand
BDBM335325
Substrate
Meas. Tech.
Inhibition Assay
IC50
0.900±n/a nM
Citation
 Boss, CBrotschi, CGude, MHeidmann, BSifferlen, TWilliams, J Benzimidazole-proline derivatives US Patent  US9732075 Publication Date 8/15/2017 
Target
Name:
Orexin/Hypocretin receptor type 1
Synonyms:
HCRTR1 OX1R_HUMAN Orexin receptor type 1 (OR 1) Orexin receptor type 1 (OX1) Orexin receptor type 1 (OxR1) | Ox1r
Type:
Protein
Mol. Mass.:
47554.50
Organism:
Homo sapiens (Human)
Description:
O43613
Residue:
425
  
Inhibitor
Name:
BDBM335325
Synonyms:
US11040966, Example 6.93 rac-[2-(4-Bromo-1H-benzoimidazol-2-yl)-4-methylene-pyrrolidin-1-yl]-(2-cyclopropyl-5-m-tolyl-thiazol-4-yl)-methanone
Type:
Small organic molecule
Emp. Form.:
C26H23BrN4OS
Mol. Mass.:
519.456
SMILES:
Cc1cccc(c1)-c1sc(nc1C(=O)N1CC(=C)CC1c1nc2c(Br)cccc2[nH]1)C1CC1
: