Target
Histamine H4 receptor
Ligand
BDBM335429
Substrate
Meas. Tech.
Binding Assay
Ki
3.50±n/a nM
Citation
 Cai, HChavez, FDunford, PJGreenspan, AJMeduna, SPQuiroz, JASavall, BMTays, KLThurmond, RLWei, JWolin, RLZhang, X Diamino-pyridine, pyrimidine, and pyridazine modulators of the histamine H4 receptor US Patent  US9732087 Publication Date 8/15/2017 
Target
Name:
Histamine H4 receptor
Synonyms:
AXOR35 GPCR105 HH4R HRH4 Histamine H4 receptor Histamine receptor (H3 and H4) SP9144
Type:
G Protein-Coupled Receptor (GPCR)
Mol. Mass.:
44517.02
Organism:
Homo sapiens (Human)
Description:
Binding assays were using CHO cells stably expressing hH4R receptors.
Residue:
390
  
Inhibitor
Name:
BDBM335429
Synonyms:
4-[(3R)-3-Aminopyrrolidin-1-yl]-N-(2-methylpropyl)pyridin-2-amine dihydrochloride | US9732087, 20
Type:
Small organic molecule
Emp. Form.:
C13H22N4
Mol. Mass.:
234.3406
SMILES:
CC(C)CNc1cc(ccn1)N1CC[C@@H](N)C1
: