Target
Beta-secretase 2
Ligand
BDBM335431
Substrate
Meas. Tech.
BACE-2 Assay
Ki
1.50±n/a nM
Citation
 Walsh, SPCumming, JNHe, STaoka, BMTruong, QTWu, W C2-carbocyclic iminothiazine dioxides as BACE inhibitors, compositions, and their use US Patent  US9732088 Publication Date 8/15/2017 
Target
Name:
Beta-secretase 2
Synonyms:
AEPLC ASP1 Asp 1 Aspartyl protease 1 BACE2_HUMAN Beta-secretase (BACE) Beta-secretase 2 (BACE-2) Beta-site APP-cleaving enzyme 2 Memapsin-1 beta-Secretase (BACE-2)
Type:
Protein
Mol. Mass.:
56171.20
Organism:
Homo sapiens (Human)
Description:
Q9Y5Z0
Residue:
518
  
Inhibitor
Name:
BDBM335431
Synonyms:
8-((4-((3R,6S)-5-amino-6- cyclopropyl-3,6-dimethyl-1,1- dioxido-3,6-dihydro-2H-1,4- thiazin-3-yl)-5-fluoropyridin-2- yl)amino)-1,7-naphthyridine-3- carbonitrile | US9732088, Example 4
Type:
Small organic molecule
Emp. Form.:
C23H22FN7O2S
Mol. Mass.:
479.53
SMILES:
C[C@]1(CS(=O)(=O)[C@@](C)(C2CC2)C(N)=N1)c1cc(Nc2nccc3cc(cnc23)C#N)ncc1F
: