Target
Beta-secretase 1
Ligand
BDBM335437
Substrate
Meas. Tech.
HTRF FRET Assay
Ki
7.10±n/a nM
Citation
 Walsh, SPCumming, JNHe, STaoka, BMTruong, QTWu, W C2-carbocyclic iminothiazine dioxides as BACE inhibitors, compositions, and their use US Patent  US9732088 Publication Date 8/15/2017 
Target
Name:
Beta-secretase 1
Synonyms:
ASP2 Aspartyl protease 2 BACE1 Beta-secretase (BACE) Beta-secretase 1 (BACE 1) Beta-secretase 1 (BACE1) Beta-site amyloid precursor protein cleaving enzyme 1 Memapsin-2 beta-Secretase (BACE-1) | beta-Secretase (BACE1)
Type:
Protein
Mol. Mass.:
55755.10
Organism:
Homo sapiens (Human)
Description:
P56817
Residue:
501
  
Inhibitor
Name:
BDBM335437
Synonyms:
(3R,6S)-5-amino-6- cyclopropyl-3-(2-fluoro-5-((3- methoxy-1,7-naphthyridin-8- yl)amino)phenyl)-6- (fluoromethyl)-3-methyl-3,6- dihydro-2H-1,4-thiazine 1,1- dioxide | US9732088, Example 7
Type:
Small organic molecule
Emp. Form.:
C24H25F2N5O3S
Mol. Mass.:
501.549
SMILES:
COc1cnc2c(Nc3ccc(F)c(c3)[C@]3(C)CS(=O)(=O)[C@@](CF)(C4CC4)C(N)=N3)nccc2c1
: