Target
Beta-secretase 1
Ligand
BDBM335447
Substrate
Meas. Tech.
HTRF FRET Assay
Ki
0.790±n/a nM
Citation
 Walsh, SPCumming, JNHe, STaoka, BMTruong, QTWu, W C2-carbocyclic iminothiazine dioxides as BACE inhibitors, compositions, and their use US Patent  US9732088 Publication Date 8/15/2017 
Target
Name:
Beta-secretase 1
Synonyms:
ASP2 Aspartyl protease 2 BACE1 Beta-secretase (BACE) Beta-secretase 1 (BACE 1) Beta-secretase 1 (BACE1) Beta-site amyloid precursor protein cleaving enzyme 1 Memapsin-2 beta-Secretase (BACE-1) | beta-Secretase (BACE1)
Type:
Protein
Mol. Mass.:
55755.10
Organism:
Homo sapiens (Human)
Description:
P56817
Residue:
501
  
Inhibitor
Name:
BDBM335447
Synonyms:
(3R,6S)-5-amino-3-(2-((3-(but- 2-yn-1-yloxy)-1,7-naphthyridin- 8-yl)amino)-5-fluoropyridin-4- yl)-6-cyclopropyl-3,6-dimethyl- 3,6-dihydro-2H-1,4-thiazine 1,1-dioxide | US9732088, Example 10
Type:
Small organic molecule
Emp. Form.:
C26H27FN6O3S
Mol. Mass.:
522.594
SMILES:
CC#CCOc1cnc2c(Nc3cc(c(F)cn3)[C@]3(C)CS(=O)(=O)[C@@](C)(C4CC4)C(N)=N3)nccc2c1
: