Target
Beta-secretase 2
Ligand
BDBM335453
Substrate
Meas. Tech.
BACE-2 Assay
Ki
3.30±n/a nM
Citation
 Walsh, SPCumming, JNHe, STaoka, BMTruong, QTWu, W C2-carbocyclic iminothiazine dioxides as BACE inhibitors, compositions, and their use US Patent  US9732088 Publication Date 8/15/2017 
Target
Name:
Beta-secretase 2
Synonyms:
AEPLC ASP1 Asp 1 Aspartyl protease 1 BACE2_HUMAN Beta-secretase (BACE) Beta-secretase 2 (BACE-2) Beta-site APP-cleaving enzyme 2 Memapsin-1 beta-Secretase (BACE-2)
Type:
Protein
Mol. Mass.:
56171.20
Organism:
Homo sapiens (Human)
Description:
Q9Y5Z0
Residue:
518
  
Inhibitor
Name:
BDBM335453
Synonyms:
(3R,6S)-5-amino-6- cyclopropyl-3-(2-fluoro-5-((3- methoxy-1,7-naphthyridin-8- yl)amino)pyridin-3-yl)-6- (fluoromethyl)-3-methyl-3,6- dihydro-2H-1,4-thiazine 1,1- dioxide | US9732088, Example 12
Type:
Small organic molecule
Emp. Form.:
C23H24F2N6O3S
Mol. Mass.:
502.537
SMILES:
COc1cnc2c(Nc3cnc(F)c(c3)[C@]3(C)CS(=O)(=O)[C@@](CF)(C4CC4)C(N)=N3)nccc2c1
: