Target
Cathepsin D
Ligand
BDBM335447
Substrate
Meas. Tech.
Cathepsin-D Assay
Ki
>9400±n/a nM
Citation
 Walsh, SPCumming, JNHe, STaoka, BMTruong, QTWu, W C2-carbocyclic iminothiazine dioxides as BACE inhibitors, compositions, and their use US Patent  US9732088 Publication Date 8/15/2017 
Target
Name:
Cathepsin D
Synonyms:
CATD_HUMAN CTSD Cathepsin D heavy chain Cathepsin D precursor
Type:
Enzyme
Mol. Mass.:
44551.72
Organism:
Homo sapiens (Human)
Description:
Human proCathepsin D (SwissProt accession number P07339) was expressed in Sf9 cells, purified, and autoactivated.
Residue:
412
  
Inhibitor
Name:
BDBM335447
Synonyms:
(3R,6S)-5-amino-3-(2-((3-(but- 2-yn-1-yloxy)-1,7-naphthyridin- 8-yl)amino)-5-fluoropyridin-4- yl)-6-cyclopropyl-3,6-dimethyl- 3,6-dihydro-2H-1,4-thiazine 1,1-dioxide | US9732088, Example 10
Type:
Small organic molecule
Emp. Form.:
C26H27FN6O3S
Mol. Mass.:
522.594
SMILES:
CC#CCOc1cnc2c(Nc3cc(c(F)cn3)[C@]3(C)CS(=O)(=O)[C@@](C)(C4CC4)C(N)=N3)nccc2c1
: