Target
Flap endonuclease 1
Ligand
BDBM167083
Substrate
Meas. Tech.
Binding Assay
Ki
2.80±n/a nM
Citation
 Eccles, WFitzgerald, AEHack, MDHawryluk, NAJones, WMKeith, JMKrawczuk, PLebsack, ADLiu, JMani, NSMcClure, KJMeduna, SPRosen, MD FLAP modulators US Patent  US9732093 Publication Date 8/15/2017 
Target
Name:
Flap endonuclease 1
Synonyms:
DNase IV FEN1 Flap structure-specific endonuclease 1 Maturation factor 1 hFEN-1
Type:
PROTEIN
Mol. Mass.:
42602.57
Organism:
Homo sapiens (Human)
Description:
ChEMBL_1517026
Residue:
380
  
Inhibitor
Name:
BDBM167083
Synonyms:
US9073876, 168 | US9732093, Compound 168
Type:
Small organic molecule
Emp. Form.:
C21H23FN6O
Mol. Mass.:
394.4453
SMILES:
CC(C)c1cc(Oc2c(F)c(ccc2C2CCC2)-c2cnc(N)nc2)nc(N)n1
: