Target
Flap endonuclease 1
Ligand
BDBM167159
Substrate
Meas. Tech.
Binding Assay
Ki
1.20±n/a nM
Citation
 Eccles, WFitzgerald, AEHack, MDHawryluk, NAJones, WMKeith, JMKrawczuk, PLebsack, ADLiu, JMani, NSMcClure, KJMeduna, SPRosen, MD FLAP modulators US Patent  US9732093 Publication Date 8/15/2017 
Target
Name:
Flap endonuclease 1
Synonyms:
DNase IV FEN1 Flap structure-specific endonuclease 1 Maturation factor 1 hFEN-1
Type:
PROTEIN
Mol. Mass.:
42602.57
Organism:
Homo sapiens (Human)
Description:
ChEMBL_1517026
Residue:
380
  
Inhibitor
Name:
BDBM167159
Synonyms:
US9073876, 241 | US9732093, Compound 241
Type:
Small organic molecule
Emp. Form.:
C26H29FN6O3
Mol. Mass.:
492.5453
SMILES:
Nc1cnc(cn1)-c1ccc(C2CCC2)c(Oc2nccc(n2)N2CCC3(CC2)OCCCO3)c1F
: