Target
Stromelysin-1
Ligand
BDBM13099
Substrate
Substance P
Meas. Tech.
Enzyme Inhibition Assay
Ki
61±n/a nM
Citation
 MacPherson, LJBayburt, EKCapparelli, MPCarroll, BJGoldstein, RJustice, MRZhu, LHu, SMelton, RAFryer, LGoldberg, RLDoughty, JRSpirito, SBlancuzzi, VWilson, DO'Byrne, EMGanu, VParker, DT Discovery of CGS 27023A, a non-peptidic, potent, and orally active stromelysin inhibitor that blocks cartilage degradation in rabbits. J Med Chem 40:2525-32 (1997)  
Target
Name:
Stromelysin-1
Synonyms:
MMP-3 MMP3_HUMAN Matrix metalloproteinase 3 Matrix metalloproteinase-3 (MMP-3) SL-1 Stromelysin 1 | Transin-1
Type:
Enzyme
Mol. Mass.:
53973.13
Organism:
Homo sapiens (Human)
Description:
P08254
Residue:
477
  
Inhibitor
Name:
BDBM13099
Synonyms:
2-[(cyclohexylmethyl)(4-methoxybenzene)sulfonamido]-N-hydroxyacetamide | CGS 27023A Analog 27
Type:
Small organic molecule
Emp. Form.:
C16H24N2O5S
Mol. Mass.:
356.437
SMILES:
COc1ccc(cc1)S(=O)(=O)N(CC1CCCCC1)CC(=O)NO
:
Substrate
Name:
Substance P
Synonyms:
Type:
Peptide
Mol. Mass.:
3656.51
Organism:
Description:
Residue:
32