Target
Potassium voltage-gated channel subfamily H member 2
Ligand
BDBM315511
Substrate
Meas. Tech.
Patch Clamp Assay
Ki
12500±n/a nM
Citation
 Fuchss, TEmde, UBuchstaller, HMederski, W Arylquinazolines US Patent  US9732094 Publication Date 8/15/2017 
Target
Name:
Potassium voltage-gated channel subfamily H member 2
Synonyms:
1,3-beta-glucan synthase component GLS2 ERG Eag-related protein 1 Ether-a-go-go-related gene (HERG) Ether-a-go-go-related gene potassium channel 1 Ether-a-go-go-related gene potassium channel 1 (hERG1) Ether-a-go-go-related protein 1 H-ERG KCNH2 Potassium voltage-gated channel subfamily H member 2 (hERG) Voltage-gated potassium channel subunit Kv11.1 hERG Potassium Channel 1 | putative potassium channel subunit
Type:
Multi-pass membrane protein
Mol. Mass.:
126672.65
Organism:
Homo sapiens (Human)
Description:
Q12809
Residue:
1159
  
Inhibitor
Name:
BDBM315511
Synonyms:
(4-Chloro-5-fluoro- pyridin-3-yl)-[4-fluoro-3- (7-morpholin-4-yl- quinazolin-4-yl)phenyl]- methanol1H NMR (500 MHz, DMSO-d6) ppm = 9.10 (s, 1H), 8.70 (s, 1H), 8.66 (s, 1H), 7.64-7.59 (m, 2H), 7.55- 7.48 (m, 2H), 7.44-7.39 (m, 1H), 7.20 (d, J = 2.2, 1H), 6.56 (d, J = 4.4, 1H), 6.12 (d, J = 4.5, 1H), 3.81- 3.74 (m, 4H), 3.47-3.40 (m, 4H) US11065253, Example 2 | US9732094, Example 2
Type:
Small organic molecule
Emp. Form.:
C24H19ClF2N4O2
Mol. Mass.:
468.883
SMILES:
OC(c1ccc(F)c(c1)-c1ncnc2cc(ccc12)N1CCOCC1)c1cncc(F)c1Cl
: