Target
Potassium voltage-gated channel subfamily H member 2
Ligand
BDBM315607
Substrate
Meas. Tech.
Patch Clamp Assay
Ki
<10000±n/a nM
Citation
 Fuchss, TEmde, UBuchstaller, HMederski, W Arylquinazolines US Patent  US9732094 Publication Date 8/15/2017 
Target
Name:
Potassium voltage-gated channel subfamily H member 2
Synonyms:
1,3-beta-glucan synthase component GLS2 ERG Eag-related protein 1 Ether-a-go-go-related gene (HERG) Ether-a-go-go-related gene potassium channel 1 Ether-a-go-go-related gene potassium channel 1 (hERG1) Ether-a-go-go-related protein 1 H-ERG KCNH2 Potassium voltage-gated channel subfamily H member 2 (hERG) Voltage-gated potassium channel subunit Kv11.1 hERG Potassium Channel 1 | putative potassium channel subunit
Type:
Multi-pass membrane protein
Mol. Mass.:
126672.65
Organism:
Homo sapiens (Human)
Description:
Q12809
Residue:
1159
  
Inhibitor
Name:
BDBM315607
Synonyms:
US10172859, Example 33 US9732094, Example 33 | [4-Fluoro-3-(7- morpholin-4-yl- quinazolin-4-yl)phenyl]- pyrazin-2-ylmethanol1H NMR (400 MHz, DMSO-d6) ppm = 9.11 (s, 1H), 8.89 (d, J = 1.5, 1H), 8.59-8.53 (m, 2H), 7.71- 7.65 (m, 2H), 7.57-7.50 (m, 2H), 7.44-7.37 (m, 1H), 7.21-7.19 (m, 1H), 5.94 (s, 1H), 3.81-3.75 (m, 4H), 3.49-3.44 (m, 4H)
Type:
Small organic molecule
Emp. Form.:
C23H20FN5O2
Mol. Mass.:
417.4356
SMILES:
OC(c1ccc(F)c(c1)-c1ncnc2cc(ccc12)N1CCOCC1)c1cnccn1
: