Target
DNA-dependent protein kinase catalytic subunit
Ligand
BDBM315742
Substrate
Meas. Tech.
Biochemical Assay
IC50
19±n/a nM
Citation
 Fuchss, TEmde, UBuchstaller, HMederski, W Arylquinazolines US Patent  US9732094 Publication Date 8/15/2017 
Target
Name:
DNA-dependent protein kinase catalytic subunit
Synonyms:
DNA-PK catalytic subunit DNA-dependent protein kinase (DNA-PK) DNA-dependent protein kinase catalytic subunit (DNA-PK) HYRC PRKDC | PRKDC_HUMAN
Type:
Protein
Mol. Mass.:
469114.78
Organism:
Homo sapiens (Human)
Description:
P78527
Residue:
4128
  
Inhibitor
Name:
BDBM315742
Synonyms:
1-[4-Fluoro-3-(7- morpholin-4-yl- quinazolin-4-yl)- phenyl]-1-thiazol- 2-ylethanol1H NMR (400 MHz, DMSO-d6) ppm = 9.11 (s,1H), 7.82-7.75 (m, 2H), 7.73 (d, J = 3.2, 1H),7.61 (d, J = 3.2, 1H), 7.53-7.50 (m, 2H), 7.41-7.36 (m, 1H), 7.20 (d, J = 1.9, 1H), 6.90 (s, 1H),3.80-3.75 (m, 4H), 3.46-3.41 (m, 4H), 1.95(s, 3H) US11065253, Example 163 | US9732094, Example 163
Type:
Small organic molecule
Emp. Form.:
C23H21FN4O2S
Mol. Mass.:
436.502
SMILES:
CC(O)(c1nccs1)c1ccc(F)c(c1)-c1ncnc2cc(ccc12)N1CCOCC1
: