Target
DNA-dependent protein kinase catalytic subunit
Ligand
BDBM315759
Substrate
Meas. Tech.
Biochemical Assay
IC50
5±n/a nM
Citation
 Fuchss, TEmde, UBuchstaller, HMederski, W Arylquinazolines US Patent  US9732094 Publication Date 8/15/2017 
Target
Name:
DNA-dependent protein kinase catalytic subunit
Synonyms:
DNA-PK catalytic subunit DNA-dependent protein kinase (DNA-PK) DNA-dependent protein kinase catalytic subunit (DNA-PK) HYRC PRKDC | PRKDC_HUMAN
Type:
Protein
Mol. Mass.:
469114.78
Organism:
Homo sapiens (Human)
Description:
P78527
Residue:
4128
  
Inhibitor
Name:
BDBM315759
Synonyms:
US10172859, Example 180 US10172859, Example 189 US9732094, Example 189 | [6-Fluoro-5-(7- morpholin-4-yl- quinazolin-4-yl)- pyridin-3-yl]thiazol- 2-ylmethanol1H NMR (400 MHz, DMSO-d6) ppm = 9.11 (s,1H), 8.56-8.52 (m, 1H), 8.21 (dd, J = 9.0, 2.3,1H), 7.77 (d, J = 3.2, 1H), 7.69 (d, J = 3.2, 1H),7.59-7.52 (m, 2H), 7.23-7.20 (m, 1H), 7.18(d, J = 4.7, 1H), 6.23 (d, J = 4.5, 1H), 3.82-3.73(m, 4H), 3.50-3.42 (m, 4H)
Type:
Small organic molecule
Emp. Form.:
C21H18FN5O2S
Mol. Mass.:
423.463
SMILES:
OC(c1nccs1)c1cnc(F)c(c1)-c1ncnc2cc(ccc12)N1CCOCC1
: