Target
Potassium voltage-gated channel subfamily H member 2
Ligand
BDBM315777
Substrate
Meas. Tech.
Patch Clamp Assay
Ki
<10000±n/a nM
Citation
 Fuchss, TEmde, UBuchstaller, HMederski, W Arylquinazolines US Patent  US9732094 Publication Date 8/15/2017 
Target
Name:
Potassium voltage-gated channel subfamily H member 2
Synonyms:
1,3-beta-glucan synthase component GLS2 ERG Eag-related protein 1 Ether-a-go-go-related gene (HERG) Ether-a-go-go-related gene potassium channel 1 Ether-a-go-go-related gene potassium channel 1 (hERG1) Ether-a-go-go-related protein 1 H-ERG KCNH2 Potassium voltage-gated channel subfamily H member 2 (hERG) Voltage-gated potassium channel subunit Kv11.1 hERG Potassium Channel 1 | putative potassium channel subunit
Type:
Multi-pass membrane protein
Mol. Mass.:
126672.65
Organism:
Homo sapiens (Human)
Description:
Q12809
Residue:
1159
  
Inhibitor
Name:
BDBM315777
Synonyms:
4-[5-(Difluoro- methoxy-thiazol-2- ylmethyl)-2-fluoro- phenyl]-7- morpholin-4-yl- quinazoline1H NMR (400 MHz, DMSO-d6) ppm = 9.11 (s,1H), 7.85 (d, J = 3.2, 1H), 7.81 (d, J = 3.2, 1H),7.73-7.71 (m, 2H), 7.55-7.52 (m, 2H), 7.52-7.48 (m, 1H), 7.22-6.82 (m, 3H), 3.80-3.75(m, 4H), 3.48-3.42 (m, 4H) US11065253, Example 199 | US9732094, Example 199
Type:
Small organic molecule
Emp. Form.:
C23H19F3N4O2S
Mol. Mass.:
472.483
SMILES:
FC(F)OC(c1nccs1)c1ccc(F)c(c1)-c1ncnc2cc(ccc12)N1CCOCC1
: