Target
Potassium voltage-gated channel subfamily H member 2
Ligand
BDBM315904
Substrate
Meas. Tech.
Patch Clamp Assay
Ki
<10000±n/a nM
Citation
 Fuchss, TEmde, UBuchstaller, HMederski, W Arylquinazolines US Patent  US9732094 Publication Date 8/15/2017 
Target
Name:
Potassium voltage-gated channel subfamily H member 2
Synonyms:
1,3-beta-glucan synthase component GLS2 ERG Eag-related protein 1 Ether-a-go-go-related gene (HERG) Ether-a-go-go-related gene potassium channel 1 Ether-a-go-go-related gene potassium channel 1 (hERG1) Ether-a-go-go-related protein 1 H-ERG KCNH2 Potassium voltage-gated channel subfamily H member 2 (hERG) Voltage-gated potassium channel subunit Kv11.1 hERG Potassium Channel 1 | putative potassium channel subunit
Type:
Multi-pass membrane protein
Mol. Mass.:
126672.65
Organism:
Homo sapiens (Human)
Description:
Q12809
Residue:
1159
  
Inhibitor
Name:
BDBM315904
Synonyms:
US10172859, Example 328 US9732094, Example 328 | [4-Fluoro-3-(7- morpholin-4-yl- quinazolin-4-yl)- phenyl]furo[2,3-c]- pyridin-7-ylmethanol1H NMR (500 MHz, DMSO-d6) ppm = 9.08 (s,1H), 8.32 (d, J = 5.2, 1H), 8.21 (d, J = 2.2, 1H), 7.74-7.67 (m, 2H), 7.64 (d, J = 5.2, 1H), 7.52-7.49 (m,2H), 7.36 (dd, J = 9.9, 8.4, 1H), 7.22-7.16 (m, 1H),7.06 (d, J = 2.2, 1H), 6.32 (d, J = 5.0, 1H), 6.25 (d,J = 5.0, 1H), 3.80-3.75 (m, 4H), 3.46-3.41 (m,4H).
Type:
Small organic molecule
Emp. Form.:
C26H21FN4O3
Mol. Mass.:
456.4683
SMILES:
OC(c1ccc(F)c(c1)-c1ncnc2cc(ccc12)N1CCOCC1)c1nccc2ccoc12
: