Target
Potassium voltage-gated channel subfamily H member 2
Ligand
BDBM315932
Substrate
Meas. Tech.
Patch Clamp Assay
Ki
<10000±n/a nM
Citation
 Fuchss, TEmde, UBuchstaller, HMederski, W Arylquinazolines US Patent  US9732094 Publication Date 8/15/2017 
Target
Name:
Potassium voltage-gated channel subfamily H member 2
Synonyms:
1,3-beta-glucan synthase component GLS2 ERG Eag-related protein 1 Ether-a-go-go-related gene (HERG) Ether-a-go-go-related gene potassium channel 1 Ether-a-go-go-related gene potassium channel 1 (hERG1) Ether-a-go-go-related protein 1 H-ERG KCNH2 Potassium voltage-gated channel subfamily H member 2 (hERG) Voltage-gated potassium channel subunit Kv11.1 hERG Potassium Channel 1 | putative potassium channel subunit
Type:
Multi-pass membrane protein
Mol. Mass.:
126672.65
Organism:
Homo sapiens (Human)
Description:
Q12809
Residue:
1159
  
Inhibitor
Name:
BDBM315932
Synonyms:
US10172859, Example 356 US9732094, Example 356 | [4-Fluoro-3-(7- morpholin-4-yl- quinazolin-4-yl)- phenyl]pyrrolo[1,2-a]- pyrazin-1-ylmethanol1H NMR (500 MHz, DMSO-d6) ppm = 9.10 (s,1H), 8.20 (dd, J = 4.8, 1.0, 1H), 7.79-7.72 (m, 3H),7.53-7.45 (m, 3H), 7.40-7.34 (m, 1H), 7.20 (d,J = 2.1, 1H), 7.02 (dt, J = 4.1, 1.2, 1H), 6.87 (dd,J = 4.1, 2.5, 1H), 6.33 (d, J = 4.9, 1H), 6.06 (d,J = 4.8, 1H), 3.82-3.76 (m, 4H), 3.48-3.42 (m,4H).
Type:
Small organic molecule
Emp. Form.:
C26H22FN5O2
Mol. Mass.:
455.4836
SMILES:
OC(c1ccc(F)c(c1)-c1ncnc2cc(ccc12)N1CCOCC1)c1nccn2cccc12
: