Target
DNA-dependent protein kinase catalytic subunit
Ligand
BDBM315937
Substrate
Meas. Tech.
Biochemical Assay
IC50
5±n/a nM
Citation
 Fuchss, TEmde, UBuchstaller, HMederski, W Arylquinazolines US Patent  US9732094 Publication Date 8/15/2017 
Target
Name:
DNA-dependent protein kinase catalytic subunit
Synonyms:
DNA-PK catalytic subunit DNA-dependent protein kinase (DNA-PK) DNA-dependent protein kinase catalytic subunit (DNA-PK) HYRC PRKDC | PRKDC_HUMAN
Type:
Protein
Mol. Mass.:
469114.78
Organism:
Homo sapiens (Human)
Description:
P78527
Residue:
4128
  
Inhibitor
Name:
BDBM315937
Synonyms:
US10172859, Example 361 US9732094, Example 361 | [2-Chloro-5-(7- morpholin-4-yl- quinazolin-4-yl)- phenyl]pyrrolo[1,2-a]- pyrazin-1-ylmethanol1H NMR (500 MHz, DMSO-d6) ppm = 9.08 (s,1H), 8.22-8.19 (m, 1H), 8.14 (d, J = 2.2, 1H), 7.89(d, J = 9.4, 1H), 7.76 (dd, J = 2.5, 1.3, 1H), 7.70 (dd,J = 8.2, 2.2, 1H), 7.61 (d, J = 8.2, 1H), 7.53 (dd,J = 9.5, 2.6, 1H). 7.43 (d, J = 4.8, 1H), 7.21 (d,J = 2.6, 1H), 7.00-6.97 (m, 1H), 6.93-6.90 (m,1H), 6.45-6.40 (m, 2H), 3.81-3.76 (m, 4H),3.48-3.42 (m, 4H).
Type:
Small organic molecule
Emp. Form.:
C26H22ClN5O2
Mol. Mass.:
471.938
SMILES:
OC(c1cc(ccc1Cl)-c1ncnc2cc(ccc12)N1CCOCC1)c1nccn2cccc12
: