Target
Potassium voltage-gated channel subfamily H member 2
Ligand
BDBM315938
Substrate
Meas. Tech.
Patch Clamp Assay
Ki
<10000±n/a nM
Citation
 Fuchss, TEmde, UBuchstaller, HMederski, W Arylquinazolines US Patent  US9732094 Publication Date 8/15/2017 
Target
Name:
Potassium voltage-gated channel subfamily H member 2
Synonyms:
1,3-beta-glucan synthase component GLS2 ERG Eag-related protein 1 Ether-a-go-go-related gene (HERG) Ether-a-go-go-related gene potassium channel 1 Ether-a-go-go-related gene potassium channel 1 (hERG1) Ether-a-go-go-related protein 1 H-ERG KCNH2 Potassium voltage-gated channel subfamily H member 2 (hERG) Voltage-gated potassium channel subunit Kv11.1 hERG Potassium Channel 1 | putative potassium channel subunit
Type:
Multi-pass membrane protein
Mol. Mass.:
126672.65
Organism:
Homo sapiens (Human)
Description:
Q12809
Residue:
1159
  
Inhibitor
Name:
BDBM315938
Synonyms:
US10172859, Example 362 US9732094, Example 362 | [2-Chloro-5-(7- morpholin-4-yl- quinazolin-4-yl)- phenyl]pyrrolo[2,1-f]- [1,2,4]triazin-4-yl- methanol1H NMR (500 MHz, DMSO-d6) ppm = 9.08 (s,1H), 8.49 (s, 1H), 8.16 (d, J = 2.2, 1H), 8.12 (dd,J = 2.6, 1.4, 1H), 7.88 (d, J = 9.4, 1H), 7.74 (dd,J = 8.2, 2.2, 1H), 7.64 (d, J = 8.2, 1H), 7.54 (dd,J = 9.5, 2.6, 1H), 7.23-7.19 (m, 2H), 7.06 (dd,J = 4.6, 2.6, 1H), 6.80 (d, J = 5.7, 1H), 6.44 (d,J = 5.7, 1H), 3.81-3.76 (m, 4H), 3.48-3.43 (m,4H).
Type:
Small organic molecule
Emp. Form.:
C25H21ClN6O2
Mol. Mass.:
472.926
SMILES:
OC(c1cc(ccc1Cl)-c1ncnc2cc(ccc12)N1CCOCC1)c1ncnn2cccc12
: