Target
DNA-dependent protein kinase catalytic subunit
Ligand
BDBM315987
Substrate
Meas. Tech.
Biochemical Assay
IC50
5±n/a nM
Citation
 Fuchss, TEmde, UBuchstaller, HMederski, W Arylquinazolines US Patent  US9732094 Publication Date 8/15/2017 
Target
Name:
DNA-dependent protein kinase catalytic subunit
Synonyms:
DNA-PK catalytic subunit DNA-dependent protein kinase (DNA-PK) DNA-dependent protein kinase catalytic subunit (DNA-PK) HYRC PRKDC | PRKDC_HUMAN
Type:
Protein
Mol. Mass.:
469114.78
Organism:
Homo sapiens (Human)
Description:
P78527
Residue:
4128
  
Inhibitor
Name:
BDBM315987
Synonyms:
US10172859, Example 410 US10172859, Example 422 US9732094, Example 422 | [2-Chloro-5-(7- morpholin-4-yl- quinazolin-4-yl)- phenyl]-(3-methoxy- pyrazin-2-yl)- methanol (Ena 2)see racemate
Type:
Small organic molecule
Emp. Form.:
C24H22ClN5O3
Mol. Mass.:
463.916
SMILES:
COc1nccnc1C(O)c1cc(ccc1Cl)-c1ncnc2cc(ccc12)N1CCOCC1
: