Target
Serine/threonine-protein kinase B-raf [V600E]
Ligand
BDBM200339
Substrate
Meas. Tech.
TBD
IC50
86.0±n/a nM
Citation
 Zhou, CZhang, G Fused tricyclic amide compounds as multiple kinase inhibitors US Patent  US9670231 Publication Date 6/6/2017 
Target
Name:
Serine/threonine-protein kinase B-raf [V600E]
Synonyms:
B-RAF V600E B-Raf Protein Kinase Mutant (V600E) BRAF BRAF mutant V600E BRAF_HUMAN Protein mono-ADP-ribosyltransferase (PARP3) RAFB1 Serine/threonine-protein kinase B-raf (V600E) V-RAF murine sarcoma viral oncogene homologue B1 mutant (BRAF V600E)
Type:
Mol. Mass.:
84474.98
Organism:
Homo sapiens (Human)
Description:
P15056 V600E
Residue:
766
  
Inhibitor
Name:
BDBM200339
Synonyms:
US9670231, 1.13
Type:
Small organic molecule
Emp. Form.:
C32H31F3N4O5
Mol. Mass.:
608.6075
SMILES:
C[C@H]1CN(Cc2ccc(cc2C(F)(F)F)C(=O)N[C@@H]2[C@H]3Oc4ccc(Oc5ccnc6NC(=O)CCc56)cc4[C@@H]23)C[C@@H](C)O1
: