Target
RAF proto-oncogene serine/threonine-protein kinase
Ligand
BDBM200504
Substrate
Meas. Tech.
TBD
IC50
2.50±n/a nM
Citation
 Zhou, CZhang, G Fused tricyclic amide compounds as multiple kinase inhibitors US Patent  US9670231 Publication Date 6/6/2017 
Target
Name:
RAF proto-oncogene serine/threonine-protein kinase
Synonyms:
C-Raf Protein Kinase RAF RAF1 Raf-1 Serine/threonine-protein kinase C-Raf | cRaf
Type:
Serine/threonine-protein kinase
Mol. Mass.:
73082.52
Organism:
Homo sapiens (Human)
Description:
P04049
Residue:
648
  
Inhibitor
Name:
BDBM200504
Synonyms:
US9670231, 1.32
Type:
Small organic molecule
Emp. Form.:
C32H33F3N6O4
Mol. Mass.:
622.6374
SMILES:
CN(C)[C@@H]1CN(Cc2ccc(cc2C(F)(F)F)C(=O)N[C@@H]2[C@H]3Oc4ccc(Oc5ccnc6NC(=O)CCc56)cc4[C@@H]23)CCN1
: