Target
Epidermal growth factor receptor [L858R]
Ligand
BDBM200788
Substrate
Meas. Tech.
TBD
IC50
2.10±n/a nM
Citation
 Zhou, CZhang, G Fused tricyclic amide compounds as multiple kinase inhibitors US Patent  US9670231 Publication Date 6/6/2017 
Target
Name:
Epidermal growth factor receptor [L858R]
Synonyms:
EGFR EGFR_HUMAN ERBB1 Epidermal growth factor receptor (L858R) HER1
Type:
Mol. Mass.:
134323.62
Organism:
Homo sapiens (Human)
Description:
P00533[L858R]
Residue:
1210
  
Inhibitor
Name:
BDBM200788
Synonyms:
US9670231, 1.71
Type:
Small organic molecule
Emp. Form.:
C32H32F3N5O4
Mol. Mass.:
607.6228
SMILES:
CN(C)C1CCN(CC1)c1ccc(cc1C(F)(F)F)C(=O)N[C@@H]1[C@H]2Oc3ccc(Oc4ccnc5NC(=O)CCc45)cc3[C@@H]12
: