Target
E3 ubiquitin-protein ligase XIAP [241-356]
Ligand
BDBM13168
Substrate
Smac-based peptide
Meas. Tech.
Ligand Binding Assay
pH
7.4±n/a
Temperature
295.15±n/a K
Kd
29±n/a nM
Citation
 Oost, TKSun, CArmstrong, RCAl-Assaad, ASBetz, SFDeckwerth, TLDing, HElmore, SWMeadows, RPOlejniczak, ETOleksijew, AOltersdorf, TRosenberg, SHShoemaker, ARTomaselli, KJZou, HFesik, SW Discovery of potent antagonists of the antiapoptotic protein XIAP for the treatment of cancer. J Med Chem 47:4417-26 (2004)  
Target
Name:
E3 ubiquitin-protein ligase XIAP [241-356]
Synonyms:
API3 BIRC4 E3 ubiquitin-protein ligase XIAP BIR-3 IAP3 X-linked inhibitor of apoptosis protein BIR3 domain (XIAP BIR-3) XIAP-BIR3 baculovirus IAP repeat 3 (BIR3) domain of XIAP
Type:
Protein Binding Domain
Mol. Mass.:
13276.62
Organism:
Homo sapiens (Human)
Description:
BIR3 of XIAP: RESIDUES 241-356.
Residue:
116
  
Inhibitor
Name:
BDBM13168
Synonyms:
(2S)-N-[(1R)-2,3-dihydro-1H-inden-1-yl]-1-[(2S)-3,3-dimethyl-2-[(2S)-2-(methylamino)propanamido]butanoyl]pyrrolidine-2-carboxamide H-N-Me-Ala-Tle-Pro-(R)-indan-1-yl Amide
Type:
Small organic molecule
Emp. Form.:
C24H36N4O3
Mol. Mass.:
428.5676
SMILES:
CN[C@@H](C)C(=O)N[C@H](C(=O)N1CCC[C@H]1C(=O)N[C@@H]1CCc2ccccc12)C(C)(C)C
:
Substrate
Name:
Smac-based peptide
Synonyms:
6-Carboxyfluorescein (FAM) labeled peptide AVPIAQK
Type:
Peptide
Mol. Mass.:
1328.08
Organism:
Description:
Residue:
12
AVPIAQKFAMNH