Target
E3 ubiquitin-protein ligase XIAP [241-356]
Ligand
BDBM13178
Substrate
Smac-based peptide
Meas. Tech.
Ligand Binding Assay
pH
7.4±n/a
Temperature
295.15±n/a K
Kd
>1000±n/a nM
Citation
 Oost, TKSun, CArmstrong, RCAl-Assaad, ASBetz, SFDeckwerth, TLDing, HElmore, SWMeadows, RPOlejniczak, ETOleksijew, AOltersdorf, TRosenberg, SHShoemaker, ARTomaselli, KJZou, HFesik, SW Discovery of potent antagonists of the antiapoptotic protein XIAP for the treatment of cancer. J Med Chem 47:4417-26 (2004)  
Target
Name:
E3 ubiquitin-protein ligase XIAP [241-356]
Synonyms:
API3 BIRC4 E3 ubiquitin-protein ligase XIAP BIR-3 IAP3 X-linked inhibitor of apoptosis protein BIR3 domain (XIAP BIR-3) XIAP-BIR3 baculovirus IAP repeat 3 (BIR3) domain of XIAP
Type:
Protein Binding Domain
Mol. Mass.:
13276.62
Organism:
Homo sapiens (Human)
Description:
BIR3 of XIAP: RESIDUES 241-356.
Residue:
116
  
Inhibitor
Name:
BDBM13178
Synonyms:
(2S,4S)-1-[(2S)-2-[(2S)-2-(dimethylamino)propanamido]-3,3-dimethylbutanoyl]-4-phenoxy-N-[(1R)-1,2,3,4-tetrahydronaphthalen-1-yl]pyrrolidine-2-carboxamide H-N,N-Me2-Ala-Tle-(4S)-4-phenoxy-Pro-(R)-tetrahydronaphth-1-yl Amide
Type:
Small organic molecule
Emp. Form.:
C32H44N4O4
Mol. Mass.:
548.7162
SMILES:
C[C@H](N(C)C)C(=O)N[C@H](C(=O)N1C[C@H](C[C@H]1C(=O)N[C@@H]1CCCc2ccccc12)Oc1ccccc1)C(C)(C)C
:
Substrate
Name:
Smac-based peptide
Synonyms:
6-Carboxyfluorescein (FAM) labeled peptide AVPIAQK
Type:
Peptide
Mol. Mass.:
1328.08
Organism:
Description:
Residue:
12
AVPIAQKFAMNH