Target
E3 ubiquitin-protein ligase XIAP [241-356]
Ligand
BDBM13209
Substrate
Smac-derived peptide
Meas. Tech.
Fluorescence Polarization Competitive Binding Assay
pH
7.5±n/a
Temperature
295.15±n/a K
Ki
2330±680 nM
Citation
 Sun, HNikolovska-Coleska, ZYang, CYXu, LTomita, YKrajewski, KRoller, PPWang, S Structure-based design, synthesis, and evaluation of conformationally constrained mimetics of the second mitochondria-derived activator of caspase that target the X-linked inhibitor of apoptosis protein/caspase-9 interaction site. J Med Chem 47:4147-50 (2004)  
Target
Name:
E3 ubiquitin-protein ligase XIAP [241-356]
Synonyms:
API3 BIRC4 E3 ubiquitin-protein ligase XIAP BIR-3 IAP3 X-linked inhibitor of apoptosis protein BIR3 domain (XIAP BIR-3) XIAP-BIR3 baculovirus IAP repeat 3 (BIR3) domain of XIAP
Type:
Protein Binding Domain
Mol. Mass.:
13276.62
Organism:
Homo sapiens (Human)
Description:
BIR3 of XIAP: RESIDUES 241-356.
Residue:
116
  
Inhibitor
Name:
BDBM13209
Synonyms:
(3S,6S,8aS)-6-[(2S)-2-aminopropanamido]-N-(diphenylmethyl)-5-oxo-octahydroindolizine-3-carboxamide Smac AVPI Mimetic 12c
Type:
Small organic molecule
Emp. Form.:
C25H30N4O3
Mol. Mass.:
434.5307
SMILES:
C[C@H](N)C(=O)N[C@H]1CC[C@H]2CC[C@H](N2C1=O)C(=O)NC(c1ccccc1)c1ccccc1
:
Substrate
Name:
Smac-derived peptide
Synonyms:
Type:
Peptide
Mol. Mass.:
619.76
Organism:
Description:
5-carboxyfluorescein was coupled to the lysine side chain of the mutated Smac peptide.
Residue:
5
ARPFK