Target
Bromodomain-containing protein 4 [75-147]
Ligand
BDBM333406
Substrate
Meas. Tech.
BRD4 AlphaScreen Assay
IC50
<100±n/a nM
Citation
 Yue, EWCombs, APBuesking, AW Bicyclic heterocycles as bet protein inhibitors US Patent  US9737516 Publication Date 8/22/2017 
Target
Name:
Bromodomain-containing protein 4 [75-147]
Synonyms:
BRD4 Bromo domain 1 Bromodomain-containing protein 4 (BRD4) Bromo 1 Bromodomain-containing protein 4 (BRD4)(Bromo 1) Bromodomain-containing protein 4 Bromodomain 1 (BRD4-1) HUNK1
Type:
Mol. Mass.:
8856.55
Organism:
Homo sapiens (Human)
Description:
BD1 (75-147 aa) of O60885
Residue:
73
  
Inhibitor
Name:
BDBM333406
Synonyms:
6-(2,4-Difluorophenoxy)-1-methyl-5-(6-methyl-7-oxo-6,7-dihydro-1H-pyrrolo[2,3-c]pyridin-4-yl)-1,3-dihydro-2H-benzimidazol-2-one | US9737516, Example 2
Type:
Small organic molecule
Emp. Form.:
C22H16F2N4O3
Mol. Mass.:
422.3842
SMILES:
Cn1c2cc(Oc3ccc(F)cc3F)c(cc2[nH]c1=O)-c1cn(C)c(=O)c2[nH]ccc12
: