Target
Bromodomain-containing protein 4 [368-440]
Ligand
BDBM333411
Substrate
Meas. Tech.
BRD4 AlphaScreen Assay
IC50
<100±n/a nM
Citation
 Yue, EWCombs, APBuesking, AW Bicyclic heterocycles as bet protein inhibitors US Patent  US9737516 Publication Date 8/22/2017 
Target
Name:
Bromodomain-containing protein 4 [368-440]
Synonyms:
BRD4 Bromo domain 2 Bromodomain-containing protein 4 (BRD4) Bromo 2 Bromodomain-containing protein 4 (BRD4)(Bromo 2) Bromodomain-containing protein 4 Bromodomain 2 (BRD4-2) HUNK1
Type:
Protein
Mol. Mass.:
8564.63
Organism:
Homo sapiens (Human)
Description:
BD2 (368-440 aa) of O60885
Residue:
73
  
Inhibitor
Name:
BDBM333411
Synonyms:
5-(2,4-Difluorophenoxy)-1,3-dimethyl-6-(6-methyl-7-oxo-6,7-dihydro-1H-pyrrolo[2,3-c]pyridin-4-yl)-1,3-dihydro-2H-benzimidazol-2-one | US9737516, Example 7
Type:
Small organic molecule
Emp. Form.:
C23H18F2N4O3
Mol. Mass.:
436.4108
SMILES:
Cn1c2cc(Oc3ccc(F)cc3F)c(cc2n(C)c1=O)-c1cn(C)c(=O)c2[nH]ccc12
: