Target
Bromodomain-containing protein 4 [368-440]
Ligand
BDBM333418
Substrate
Meas. Tech.
BRD4 AlphaScreen Assay
IC50
<100±n/a nM
Citation
 Yue, EWCombs, APBuesking, AW Bicyclic heterocycles as bet protein inhibitors US Patent  US9737516 Publication Date 8/22/2017 
Target
Name:
Bromodomain-containing protein 4 [368-440]
Synonyms:
BRD4 Bromo domain 2 Bromodomain-containing protein 4 (BRD4) Bromo 2 Bromodomain-containing protein 4 (BRD4)(Bromo 2) Bromodomain-containing protein 4 Bromodomain 2 (BRD4-2) HUNK1
Type:
Protein
Mol. Mass.:
8564.63
Organism:
Homo sapiens (Human)
Description:
BD2 (368-440 aa) of O60885
Residue:
73
  
Inhibitor
Name:
BDBM333418
Synonyms:
4-[5-(Cyclobutylmethoxy)-1-methyl-1H-benzimidazol-6-yl]-6-methyl-1,6-dihydro-7H-pyrrolo[2,3-c]pyridin-7-one and 4-[6-(Cyclobutylmethoxy)-1-methyl-1H-benzimidazol-5-yl]-6-methyl-1,6-dihydro-7H-pyrrolo[2,3-c]pyridin-7-one US9737516, Example 15
Type:
Small organic molecule
Emp. Form.:
C21H22N4O2
Mol. Mass.:
362.425
SMILES:
Cn1cnc2cc(OCC3CCC3)c(cc12)-c1cn(C)c(=O)c2[nH]ccc12
: