Target
NAD-dependent protein deacetylase sirtuin-2
Ligand
BDBM333460
Substrate
Meas. Tech.
Biochemical Deacetylation Assay
IC50
6000±n/a nM
Citation
 Kazantsev, AGThompson, LMAbagyan, RCasale, M Small molecule activators of NRF2 pathway US Patent  US9737525 Publication Date 8/22/2017 
Target
Name:
NAD-dependent protein deacetylase sirtuin-2
Synonyms:
NAD-Dependent Deacetylase Sirtuin-2 NAD-dependent deacetylase sirtuin 3 SIR2-like SIR2L SIR2_HUMAN Sirtuin 2 (SIRT2)
Type:
Hydrolase
Mol. Mass.:
43172.62
Organism:
Homo sapiens (Human)
Description:
Residue:
389
  
Inhibitor
Name:
BDBM333460
Synonyms:
US9737525, Compound MIND4-22
Type:
Small organic molecule
Emp. Form.:
C27H23N3OS
Mol. Mass.:
437.556
SMILES:
C(Oc1cccc2ccccc12)c1nnc(SCc2ccccc2)n1Cc1ccccc1
: