Target
Serine protease 1
Ligand
BDBM13283
Substrate
BDBM12500
Meas. Tech.
Enzyme Assay and Determination of the Inhibition Constants.
pH
7.5±n/a
Temperature
295.15±n/a K
Ki
189±n/a nM
Citation
 Choi-Sledeski, YMMcGarry, DGGreen, DMMason, HJBecker, MRDavis, RSEwing, WRDankulich, WPManetta, VEMorris, RLSpada, APCheney, DLBrown, KDColussi, DJChu, VHeran, CLMorgan, SRBentley, RGLeadley, RJMaignan, SGuilloteau, JPDunwiddie, CTPauls, HW Sulfonamidopyrrolidinone factor Xa inhibitors: potency and selectivity enhancements via P-1 and P-4 optimization. J Med Chem 42:3572-87 (1999)  
Target
Name:
Serine protease 1
Synonyms:
Beta-Trypsin PRSS1 TRY1 TRYP1 Trypsin I
Type:
Enzyme
Mol. Mass.:
25790.52
Organism:
Bos taurus (bovine)
Description:
P00760
Residue:
246
  
Inhibitor
Name:
BDBM13283
Synonyms:
4-amino-3-({(3S)-3-[[(7-methoxy-2-naphthyl)sulfonyl](methyl)amino]-2-oxopyrrolidin-1-yl}methyl)benzenecarboximidamide Sulfonamidopyrrolidinone 4b
Type:
Small organic molecule
Emp. Form.:
C24H27N5O4S
Mol. Mass.:
481.567
SMILES:
COc1ccc2ccc(cc2c1)S(=O)(=O)N(C)[C@H]1CCN(Cc2cc(ccc2N)C(N)=N)C1=O
:
Substrate
Name:
BDBM12500
Synonyms:
Cbz-D-Arg-Gly-L-Arg-pNA N-a-Benzyloxycarbonyl-Darginyl-L-glycyl-L-arginine-pnitroaniline benzyl N-[(1R)-4-carbamimidamido-1-[({[(1S)-4-carbamimidamido-1-[(4-nitrophenyl)carbamoyl]butyl]carbamoyl}methyl)carbamoyl]butyl]carbamate
Type:
Small organic molecule
Emp. Form.:
C28H39N11O7
Mol. Mass.:
641.6788
SMILES:
[#7]\[#6](-[#7])=[#7]/[#6]-[#6]-[#6]-[#6@@H](-[#7]-[#6](=O)-[#8]-[#6]-c1ccccc1)-[#6](=O)-[#7]-[#6]-[#6](=O)-[#7]-[#6@@H](-[#6]-[#6]-[#6]-[#7+]=[#6](-[#7])-[#7-])-[#6](=O)-[#7]-c1ccc(cc1)-[#7+](-[#8-])=O
: