Target
Coagulation factor X
Ligand
BDBM13303
Substrate
BDBM12593
Meas. Tech.
Enzyme Assay and Determination of the Inhibition Constants.
Ki
6.0±n/a nM
Citation
 Choi-Sledeski, YMMcGarry, DGGreen, DMMason, HJBecker, MRDavis, RSEwing, WRDankulich, WPManetta, VEMorris, RLSpada, APCheney, DLBrown, KDColussi, DJChu, VHeran, CLMorgan, SRBentley, RGLeadley, RJMaignan, SGuilloteau, JPDunwiddie, CTPauls, HW Sulfonamidopyrrolidinone factor Xa inhibitors: potency and selectivity enhancements via P-1 and P-4 optimization. J Med Chem 42:3572-87 (1999)  
Target
Name:
Coagulation factor X
Synonyms:
Activated coagulation factor X (FXa) Coagulation factor X precursor F10 Factor X heavy chain Factor Xa Stuart-Prower factor
Type:
Enzyme
Mol. Mass.:
54726.60
Organism:
Homo sapiens (Human)
Description:
Residue:
488
  
Inhibitor
Name:
BDBM13303
Synonyms:
4-Amino-3-[2-oxo-3-(S)-(5-pyridin-3-ylthiophene-2-ylsulfonylamino)pyrrolidin-1-ylmethyl]benzamidine Sulfonamidopyrrolidinone 4c
Type:
Small organic molecule
Emp. Form.:
C21H22N6O3S2
Mol. Mass.:
470.568
SMILES:
NC(=N)c1ccc(N)c(CN2CC[C@H](NS(=O)(=O)c3ccc(s3)-c3cccnc3)C2=O)c1
:
Substrate
Name:
BDBM12593
Synonyms:
Chromogenic Substrate Spectrozyme FXa Methoxycarbonyl-D-cyclohexylglycyl-glycyl-arginine-para-nitroanilide acetate | acetic acid; methyl N-[(R)-[({[(1S)-4-carbamimidamido-1-[(4-nitrophenyl)carbamoyl]butyl]carbamoyl}methyl)carbamoyl](cyclohexyl)methyl]carbamate
Type:
Small organic molecule
Emp. Form.:
C24H36N8O7
Mol. Mass.:
548.592
SMILES:
COC(=O)N[C@H](C1CCCCC1)C(=O)NCC(=O)N[C@@H](CCCNC(N)=N)C(=O)Nc1ccc(cc1)[N+]([O-])=O
: