Target
AP2-associated protein kinase 1
Ligand
BDBM335590
Substrate
Meas. Tech.
Kinase Assay
IC50
55±n/a nM
Citation
 Dzierba, CDDasgupta, BMacor, JEBronson, JJRajamani, RKarageorge, GN Pyrrolotriazine kinase inhibitors US Patent  US9737542 Publication Date 8/22/2017 
Target
Name:
AP2-associated protein kinase 1
Synonyms:
AAK1 Adaptor-associated kinase 1 | KIAA1048
Type:
PROTEIN
Mol. Mass.:
103884.23
Organism:
Homo sapiens (Human)
Description:
ChEMBL_774569
Residue:
961
  
Inhibitor
Name:
BDBM335590
Synonyms:
3-((5-((4-aminopiperidin-1-yl)methyl)pyrrolo[2,1-f][1,2,4]triazin-4-yl)amino)-N-isobutylbenzamide | US9737542, Example 33
Type:
Small organic molecule
Emp. Form.:
C23H31N7O
Mol. Mass.:
421.5385
SMILES:
CC(C)CNC(=O)c1cccc(Nc2ncnn3ccc(CN4CCC(N)CC4)c23)c1
: