Target
AP2-associated protein kinase 1
Ligand
BDBM335596
Substrate
Meas. Tech.
Kinase Assay
IC50
55±n/a nM
Citation
 Dzierba, CDDasgupta, BMacor, JEBronson, JJRajamani, RKarageorge, GN Pyrrolotriazine kinase inhibitors US Patent  US9737542 Publication Date 8/22/2017 
Target
Name:
AP2-associated protein kinase 1
Synonyms:
AAK1 Adaptor-associated kinase 1 | KIAA1048
Type:
PROTEIN
Mol. Mass.:
103884.23
Organism:
Homo sapiens (Human)
Description:
ChEMBL_774569
Residue:
961
  
Inhibitor
Name:
BDBM335596
Synonyms:
N-(3-(5-isopropyl-1,2,4-oxadiazol-3-yl)phenyl)-5-((4-(methylamino)piperidin-1-yl)methyl)pyrrolo[2,1-f][1,2,4]triazin-4-amine | US9737542, Example 39
Type:
Small organic molecule
Emp. Form.:
C24H30N8O
Mol. Mass.:
446.548
SMILES:
CNC1CCN(Cc2ccn3ncnc(Nc4cccc(c4)-c4noc(n4)C(C)C)c23)CC1
: