Target
AP2-associated protein kinase 1
Ligand
BDBM335608
Substrate
Meas. Tech.
Kinase Assay
IC50
5.5±n/a nM
Citation
 Dzierba, CDDasgupta, BMacor, JEBronson, JJRajamani, RKarageorge, GN Pyrrolotriazine kinase inhibitors US Patent  US9737542 Publication Date 8/22/2017 
Target
Name:
AP2-associated protein kinase 1
Synonyms:
AAK1 Adaptor-associated kinase 1 | KIAA1048
Type:
PROTEIN
Mol. Mass.:
103884.23
Organism:
Homo sapiens (Human)
Description:
ChEMBL_774569
Residue:
961
  
Inhibitor
Name:
BDBM335608
Synonyms:
5-((4-aminopiperidin-1-yl)methyl)-N-(3-fluoro-5-(2-isopropyl-2H-tetrazol-5-yl)phenyl)pyrrolo[2,1-f][1,2,4]triazin-4-amine | US9737542, Example 51
Type:
Small organic molecule
Emp. Form.:
C22H27FN10
Mol. Mass.:
450.5152
SMILES:
CC(C)n1nnc(n1)-c1cc(F)cc(Nc2ncnn3ccc(CN4CCC(N)CC4)c23)c1
: