Target
AP2-associated protein kinase 1
Ligand
BDBM335642
Substrate
Meas. Tech.
Kinase Assay
IC50
67.0±n/a nM
Citation
 Dzierba, CDDasgupta, BMacor, JEBronson, JJRajamani, RKarageorge, GN Pyrrolotriazine kinase inhibitors US Patent  US9737542 Publication Date 8/22/2017 
Target
Name:
AP2-associated protein kinase 1
Synonyms:
AAK1 Adaptor-associated kinase 1 | KIAA1048
Type:
PROTEIN
Mol. Mass.:
103884.23
Organism:
Homo sapiens (Human)
Description:
ChEMBL_774569
Residue:
961
  
Inhibitor
Name:
BDBM335642
Synonyms:
N-(3-(5-(1-amino-2-methylpropan-2-yl)-1,2,4-oxadiazol-3-yl)phenyl)pyrrolo[2,1-f][1,2,4]triazin-4-amine | US9737542, Example 82
Type:
Small organic molecule
Emp. Form.:
C18H17N9O
Mol. Mass.:
375.3873
SMILES:
CC(C)(CN=[N+]=[N-])c1nc(no1)-c1cccc(Nc2ncnn3cccc23)c1
: