Target
AP2-associated protein kinase 1
Ligand
BDBM335645
Substrate
Meas. Tech.
Kinase Assay
IC50
82.0±n/a nM
Citation
 Dzierba, CDDasgupta, BMacor, JEBronson, JJRajamani, RKarageorge, GN Pyrrolotriazine kinase inhibitors US Patent  US9737542 Publication Date 8/22/2017 
Target
Name:
AP2-associated protein kinase 1
Synonyms:
AAK1 Adaptor-associated kinase 1 | KIAA1048
Type:
PROTEIN
Mol. Mass.:
103884.23
Organism:
Homo sapiens (Human)
Description:
ChEMBL_774569
Residue:
961
  
Inhibitor
Name:
BDBM335645
Synonyms:
3-(5-isopropyl-1,2,4-oxadiazol-3-yl)-5-(pyrrolo[2,1-f][1,2,4]triazin-4-ylamino)phenol | US9737542, Example 85
Type:
Small organic molecule
Emp. Form.:
C17H16N6O2
Mol. Mass.:
336.3479
SMILES:
CC(C)c1nc(no1)-c1cc(O)cc(Nc2ncnn3cccc23)c1
: