Target
AP2-associated protein kinase 1
Ligand
BDBM335648
Substrate
Meas. Tech.
Kinase Assay
IC50
22.0±n/a nM
Citation
 Dzierba, CDDasgupta, BMacor, JEBronson, JJRajamani, RKarageorge, GN Pyrrolotriazine kinase inhibitors US Patent  US9737542 Publication Date 8/22/2017 
Target
Name:
AP2-associated protein kinase 1
Synonyms:
AAK1 Adaptor-associated kinase 1 | KIAA1048
Type:
PROTEIN
Mol. Mass.:
103884.23
Organism:
Homo sapiens (Human)
Description:
ChEMBL_774569
Residue:
961
  
Inhibitor
Name:
BDBM335648
Synonyms:
N-(3-(2-isopropyl-2H-tetrazol-5-yl)phenyl)-5-methylpyrrolo[2,1-f][1,2,4]triazin-4-amine | US9737542, Example 88
Type:
Small organic molecule
Emp. Form.:
C17H18N8
Mol. Mass.:
334.3784
SMILES:
CC(C)n1nnc(n1)-c1cccc(Nc2ncnn3ccc(C)c23)c1
: