Target
Protein farnesyltransferase/geranylgeranyltransferase type-1 subunit alpha
Ligand
BDBM13312
Substrate
biotinylated lamin B peptide substrate
Meas. Tech.
PFT IC50 Determination
pH
7.5±n/a
Temperature
310.15±n/a K
IC50
>1000±n/a nM
Citation
 Glenn, MPChang, SYHorney, CRivas, KYokoyama, KPusateri, EEFletcher, SCummings, CGBuckner, FSPendyala, PRChakrabarti, DSebti, SMGelb, MVan Voorhis, WCHamilton, AD Structurally simple, potent, Plasmodium selective farnesyltransferase inhibitors that arrest the growth of malaria parasites. J Med Chem 49:5710-27 (2006)  
Target
Name:
Protein farnesyltransferase/geranylgeranyltransferase type-1 subunit alpha
Synonyms:
CAAX farnesyltransferase alpha subunit FTase-alpha GGTase-I-alpha Protein farnesyltransferase/geranylgeranyltransferase type I alpha subunit Type I protein geranyl-geranyltransferase alpha subunit | geranylgeranyltransferase type-I
Type:
Enzyme
Mol. Mass.:
44030.14
Organism:
Rattus norvegicus (rat)
Description:
Recombinant rat enzyme.
Residue:
377
  
Inhibitor
Name:
BDBM13312
Synonyms:
1-Methyl-1H-imidazole-4-sulfonic Acid {2-[Biphenyl-4-yl-(3-methyl-3H-imidazol-4-ylmethyl)amino]ethyl}-(2-methylbenzyl)amide Sulfonamide 12c
Type:
Small organic molecule
Emp. Form.:
C31H34N6O2S
Mol. Mass.:
554.706
SMILES:
Cc1ccccc1CN(CCN(Cc1cncn1C)c1ccc(cc1)-c1ccccc1)S(=O)(=O)c1cn(C)cn1
:
Substrate
Name:
biotinylated lamin B peptide substrate
Synonyms:
Type:
Peptide
Mol. Mass.:
1715.01
Organism:
Description:
A human lamin-B carboxy-terminus sequence peptide (biotin-YRASNRSCAIM) is 3H-farnesylated at the cysteine residue when processed by farnesyltransferase.
Residue:
15
ITINYRASNRSCAIM