Target
Vascular endothelial growth factor receptor 2
Ligand
BDBM335672
Substrate
Meas. Tech.
KDR (VEGFR2) (Enzymatic Assay)
IC50
<1000±n/a nM
Citation
 Angibaud, PRPilatte, INQuerolle, OA Compounds US Patent  US9737544 Publication Date 8/22/2017 
Target
Name:
Vascular endothelial growth factor receptor 2
Synonyms:
CD_antigen=CD309 Fetal liver kinase 1 (FLK-1) KDR Protein-tyrosine kinase receptor Flk-1 VEGFR-2 VEGFR2 Vascular Endothelial Growth Factor Receptor Kinase 2 Vascular endothelial growth factor receptor 2 (KDR) Vascular endothelial growth factor receptor 2 (VEGFR2) Vascular endothelial growth factor receptor-2 (VEGFR-2)
Type:
Receptor Tyrosine Kinase
Mol. Mass.:
151510.97
Organism:
Homo sapiens (Human)
Description:
P35968
Residue:
1356
  
Inhibitor
Name:
BDBM335672
Synonyms:
US9737544, Compound 1
Type:
Small organic molecule
Emp. Form.:
C20H17N5O3
Mol. Mass.:
375.3807
SMILES:
COc1cc(OC)cc(c1)C(=O)c1ccc2ncc(nc2n1)-c1cnn(C)c1
: