Target
Fibroblast growth factor receptor 2
Ligand
BDBM335673
Substrate
Meas. Tech.
FGFR2 (Enzymatic Assay)
IC50
501±n/a nM
Citation
 Angibaud, PRPilatte, INQuerolle, OA Compounds US Patent  US9737544 Publication Date 8/22/2017 
Target
Name:
Fibroblast growth factor receptor 2
Synonyms:
BEK FGFR-2 FGFR2 Fibroblast growth factor receptor 2 (FGFR2) KGFR Keratinocyte growth factor receptor VEGF-receptor 2 and Fibroblast growth factor receptor 2
Type:
Enzyme
Mol. Mass.:
92015.45
Organism:
Homo sapiens (Human)
Description:
P21802
Residue:
821
  
Inhibitor
Name:
BDBM335673
Synonyms:
US9737544, Compound 2
Type:
Small organic molecule
Emp. Form.:
C20H19N5O3
Mol. Mass.:
377.3966
SMILES:
COc1cc(OC)cc(c1)C(O)c1ccc2ncc(nc2n1)-c1cnn(C)c1
: