Target
Fibroblast growth factor receptor 3
Ligand
BDBM335677
Substrate
Meas. Tech.
FGFR3 (Enzymatic Assay)
IC50
126±n/a nM
Citation
 Angibaud, PRPilatte, INQuerolle, OA Compounds US Patent  US9737544 Publication Date 8/22/2017 
Target
Name:
Fibroblast growth factor receptor 3
Synonyms:
CD_antigen: CD333 FGFR3 Fibroblast growth factor receptor JTK4
Type:
Protein
Mol. Mass.:
87699.57
Organism:
Homo sapiens (Human)
Description:
P22607
Residue:
806
  
Inhibitor
Name:
BDBM335677
Synonyms:
US9737544, Compound 6
Type:
Small organic molecule
Emp. Form.:
C23H22N6O3
Mol. Mass.:
430.4592
SMILES:
CNC(=O)\C=C(/c1cc(OC)cc(OC)c1)c1ccc2ncc(nc2n1)-c1cnn(C)c1
: